Climate and Forecast Standard Names
type: ConceptScheme
has top concept: sea_ice_x_transport

sea_ice_x_transport
type: Concept
source: cf-standard-name-table.html
definition: "x" indicates a vector component along the grid x-axis, positive with increasing x. "Sea ice" means all ice floating in the sea which has formed from freezing sea water, rather than by other processes such as calving of land ice to form icebergs.
in scheme: Climate and Forecast Standard Names
note: Mapping to be determined
top concept of: Climate and Forecast Standard Names