Climate and Forecast Standard Names
type: ConceptScheme
has top concept: sea_ice_freeboard

sea_ice_freeboard
type: Concept
source: cf-standard-name-table.html
definition: Sea ice freeboard is the height of the sea-ice upper surface above the water surface. "Sea ice" means all ice floating in the sea which has formed from freezing sea water, rather than by other processes such as calving of land ice to form icebergs.
in scheme: Climate and Forecast Standard Names
note: Mapping to be determined
top concept of: Climate and Forecast Standard Names