Climate and Forecast Standard Names
type: ConceptScheme
has top concept: precipitation_flux_containing_18O

precipitation_flux_containing_18O
type: Concept
source: cf-standard-name-table.html
definition: In accordance with common usage in geophysical disciplines, "flux" implies per unit area, called "flux density" in physics. "Precipitation" in the earth's atmosphere means precipitation of water in all phases. The chemical formula for water is H2O. "O" means the element "oxygen" and "18O" is the stable isotope "oxygen-18".
in scheme: Climate and Forecast Standard Names
note: Mapping to be determined
top concept of: Climate and Forecast Standard Names