Climate and Forecast Standard Names
type: ConceptScheme
has top concept: planetary_albedo

planetary_albedo
type: Concept
source: cf-standard-name-table.html
definition: Albedo is the ratio of outgoing to incoming shortwave irradiance, where 'shortwave irradiance' means that both the incoming and outgoing radiation are integrated across the solar spectrum.
in scheme: Climate and Forecast Standard Names
note: Mapping to be determined
top concept of: Climate and Forecast Standard Names