Climate and Forecast Standard Names
type: ConceptScheme
has top concept: photolysis_rate_of_nitrogen_dioxide

photolysis_rate_of_nitrogen_dioxide
type: Concept
source: cf-standard-name-table.html
definition: "Photolysis" is a chemical reaction in which a chemical compound is broken down by photons. The "reaction rate" is the rate at which the reactants of a chemical reaction form the products. The chemical formula for nitrogen dioxide is NO2.
in scheme: Climate and Forecast Standard Names
note: Mapping to be determined
top concept of: Climate and Forecast Standard Names