Climate and Forecast Standard Names
type: ConceptScheme
has top concept: northward_transformed_eulerian_mean_air_velocity

northward_transformed_eulerian_mean_air_velocity
type: Concept
replaces: northward transformed eulerian mean velocity
source: cf-standard-name-table.html
definition: "Northward" indicates a vector component which is positive when directed northward (negative southward). The "Transformed Eulerian Mean" refers to a formulation of the mean equations which incorporates some eddy terms into the definition of the mean, described in Andrews et al (1987): Middle Atmospheric Dynamics. Academic Press.
in scheme: Climate and Forecast Standard Names
note: Mapping to be determined
top concept of: Climate and Forecast Standard Names