Climate and Forecast Standard Names
type: ConceptScheme
has top concept: northward_flood_water_velocity

northward_flood_water_velocity
type: Concept
source: cf-standard-name-table.html
definition: A velocity is a vector quantity. "Northward" indicates a vector component which is positive when directed northward (negative southward). Flood water is water that covers land which is normally not covered by water.
in scheme: Climate and Forecast Standard Names
note: Mapping to be determined
top concept of: Climate and Forecast Standard Names