Climate and Forecast Standard Names
type: ConceptScheme
has top concept: mass_content_of_water_in_soil

mass_content_of_water_in_soil
type: Concept
replaces: soil moisture content
source: cf-standard-name-table.html
definition: "Water" means water in all phases. "Content" indicates a quantity per unit area. The mass content of water in soil refers to the vertical integral from the surface down to the bottom of the soil model. For the content between specified levels in the soil, standard names including "content_of_soil_layer" are used.
in scheme: Climate and Forecast Standard Names
note: Mapping to be determined
top concept of: Climate and Forecast Standard Names