Climate and Forecast Standard Names
type: ConceptScheme
has top concept: lwe_thickness_of_water_evaporation_amount

lwe_thickness_of_water_evaporation_amount
type: Concept
source: cf-standard-name-table.html
definition: 'lwe' means liquid water equivalent. 'Amount' means mass per unit area. The construction lwe_thickness_of_X_amount or _content means the vertical extent of a layer of liquid water having the same mass per unit area. 'Water' means water in all phases. Evaporation is the conversion of liquid or solid into vapor. (The conversion of solid alone into vapor is called 'sublimation'.)
in scheme: Climate and Forecast Standard Names
note: Mapping to be determined
top concept of: Climate and Forecast Standard Names