Climate and Forecast Standard Names
type: ConceptScheme
has top concept: lwe_thickness_of_convective_precipitation_amount

lwe_thickness_of_convective_precipitation_amount
type: Concept
source: cf-standard-name-table.html
definition: The construction lwe_thickness_of_X_amount or _content means the vertical extent of a layer of liquid water having the same mass per unit area. Convective precipitation is that produced by the convection schemes in an atmosphere model. "Precipitation" in the earth's atmosphere means precipitation of water in all phases. The abbreviation "lwe" means liquid water equivalent.
in scheme: Climate and Forecast Standard Names
note: Mapping to be determined
top concept of: Climate and Forecast Standard Names