Climate and Forecast Standard Names
type: ConceptScheme
has top concept: lwe_stratiform_precipitation_rate

lwe_stratiform_precipitation_rate
type: Concept
replaces: lwe large scale precipitation rate
source: cf-standard-name-table.html
definition: Stratiform precipitation, whether liquid or frozen, is precipitation that formed in stratiform cloud. "Precipitation" in the earth's atmosphere means precipitation of water in all phases. The abbreviation "lwe" means liquid water equivalent. "Precipitation rate" means the depth or thickness of the layer formed by precipitation per unit time.
in scheme: Climate and Forecast Standard Names
note: Mapping to be determined
top concept of: Climate and Forecast Standard Names