Climate and Forecast Standard Names
type: ConceptScheme
has top concept: land_ice_y_velocity

land_ice_y_velocity
type: Concept
source: cf-standard-name-table.html
definition: A velocity is a vector quantity. "y" indicates a vector component along the grid y-axis, positive with increasing y. "Land ice" means glaciers, ice-caps and ice-sheets resting on bedrock and also includes ice-shelves.
in scheme: Climate and Forecast Standard Names
note: Mapping to be determined
top concept of: Climate and Forecast Standard Names