Climate and Forecast Standard Names
type: ConceptScheme
has top concept: land_ice_calving_rate

land_ice_calving_rate
type: Concept
source: cf-standard-name-table.html
definition: "Land ice" means glaciers, ice-caps and ice-sheets resting on bedrock and also includes ice-shelves. The land ice calving rate is the rate at which ice is lost per unit area through calving into the ocean.
in scheme: Climate and Forecast Standard Names
note: Mapping to be determined
top concept of: Climate and Forecast Standard Names