Climate and Forecast Standard Names
type: ConceptScheme
has top concept: horizontal_atmosphere_dry_energy_transport

horizontal_atmosphere_dry_energy_transport
type: Concept
source: cf-standard-name-table.html
definition: Dry energy is the sum of dry static energy and kinetic energy. Dry static energy is the sum of enthalpy and potential energy (itself the sum of gravitational and centripetal potential energy). Enthalpy can be written either as (1) CpT, where Cp is heat capacity at constant pressure, T is absolute temperature, or (2) U+pV, where U is internal energy, p is pressure and V is volume.
in scheme: Climate and Forecast Standard Names
note: Mapping to be determined
top concept of: Climate and Forecast Standard Names