Climate and Forecast Standard Names
type: ConceptScheme
has top concept: floating_ice_sheet_area_fraction

floating_ice_sheet_area_fraction
type: Concept
is replaced by: floating_ice_shelf_area_fraction
source: cf-standard-name-table.html
deprecated: true
definition: "X_area_fraction" means the fraction of horizontal area occupied by X. A "floating ice sheet", sometimes called an "ice shelf", indicates where the ice sheet is flowing over sea water.
in scheme: Climate and Forecast Standard Names
note: deprecated
top concept of: Climate and Forecast Standard Names

floating_ice_shelf_area_fraction
type: Concept