Climate and Forecast Standard Names
type: ConceptScheme
has top concept: downward_sea_ice_basal_salt_flux

downward_sea_ice_basal_salt_flux
type: Concept
source: cf-standard-name-table.html
definition: "Downward" indicates a vector component which is positive when directed downward (negative upward). In accordance with common usage in geophysical disciplines, "flux" implies per unit area, called "flux density" in physics. "Sea ice" means all ice floating in the sea which has formed from freezing sea water, rather than by other processes such as calving of land ice to form icebergs.
in scheme: Climate and Forecast Standard Names
note: Mapping to be determined
top concept of: Climate and Forecast Standard Names