Climate and Forecast Standard Names
type: ConceptScheme
has top concept: brunt_vaisala_frequency_in_air

brunt_vaisala_frequency_in_air
type: Concept
source: cf-standard-name-table.html
definition: Frequency is the number of oscillations of a wave per unit time. Brunt-Vaisala frequency is also sometimes called "buoyancy frequency" and is a measure of the vertical stratification of the medium.
in scheme: Climate and Forecast Standard Names
note: Mapping to be determined
top concept of: Climate and Forecast Standard Names