Climate and Forecast Standard Names
type: ConceptScheme
has top concept: brightness_temperature

brightness_temperature
type: Concept
source: cf-standard-name-table.html
definition: The brightness temperature of a body is the temperature of a black body which radiates the same power per unit solid angle per unit area.
in scheme: Climate and Forecast Standard Names
top concept of: Climate and Forecast Standard Names