Climate and Forecast Standard Names
type: ConceptScheme
has top concept: air_pressure_at_sea_level

air_pressure_at_mean_sea_level
type: Concept
replaces: air_pressure_at_sea_level

air_pressure_at_sea_level
type: Concept
is replaced by: air_pressure_at_mean_sea_level
source: cf-standard-name-table.html
deprecated: true
definition: Air pressure at sea level is the quantity often abbreviated as MSLP or PMSL. Air pressure is the force per unit area which would be exerted when the moving gas molecules of which the air is composed strike a theoretical surface of any orientation. "Mean sea level" means the time mean of sea surface elevation at a given location over an arbitrary period sufficient to eliminate the tidal signals.
in scheme: Climate and Forecast Standard Names
note: deprecated
top concept of: Climate and Forecast Standard Names